BDBM201031 US9540373, 20::US9879026, Example 20::USRE47636, Example 20
SMILES CN1CCC2(C1)OC(=O)c1cnc(cc21)-c1ccc(C[C@H](NC(=O)[C@H]2N[C@@H]3CC[C@H]2C3)C#N)c(F)c1
InChI Key InChIKey=YZPZXQUEXBVKKM-IKHSKEIOSA-N
Data  3 IC50
  Tab Delimited (TSV)   2D SDfile   Computed 3D by Vconf -m prep SDfile
Find this compound or compounds like it in BindingDB:
Activity Spreadsheet -- Enzyme Inhibition Constant Data from BindingDB
Found 3 hits for monomerid = 201031
TargetDipeptidyl peptidase 1(Homo sapiens (Human))
Boehringer Ingelheim International
US Patent
LigandPNGBDBM201031(US9540373, 20 | US9879026, Example 20 | USRE47636,...)
Affinity DataIC50:  1.60nMT: 2°C. Assay description: The recombinant human DPPI was diluted in TAGZyme buffer to 1 U/ml (38.1 μg/ml, respectively), and then activated by mixing in a 1:2 ratio with ...
Ligand InfoPC cidPC sid
In DepthDetails US Patent
TargetDipeptidyl peptidase 1(Homo sapiens (Human))
Boehringer Ingelheim International
US Patent
LigandPNGBDBM201031(US9540373, 20 | US9879026, Example 20 | USRE47636,...)
Affinity DataIC50:  1.60nM. Assay description: Materials: Microtiterplates (Optiplate-384 F) were purchased from PerkinElmer (Prod. No. 10 6007270). The substrate Gly-Arg-AMC was from Biotrend (Pr...
Ligand InfoPC cidPC sid
In DepthDetails US Patent
TargetDipeptidyl peptidase 1(Homo sapiens (Human))
Boehringer Ingelheim International
US Patent
LigandPNGBDBM201031(US9540373, 20 | US9879026, Example 20 | USRE47636,...)
Affinity DataIC50:  1.60nMT: 2°C. Assay description: Assay conditions: The recombinant human DPPI was diluted in TAGZyme buffer to 1 U/ml (38.1 μg/ml, respectively), and then activated by mixing in...
Ligand InfoPC cidPC sid
In DepthDetails US Patent